طراحی شبکه
type: Concept
broader: طراحی
preferred label: network design @en
scope note: فرایند تعیین کمیت‌ها و معماری مدار و تجهیزات برای رسیدن به توازن در هزینه و خدمات

طراحی
type: Concept
narrower: طراحی شبکه
preferred label: design @en