نرم‌افزار رایانه‌ای
type: Concept
preferred label: computer software @en
related: طراحی بالابه‌پایین

طراحی بالابه‌پایین
type: Concept
broader: طراحی
preferred label: top-down design @en
related: نرم‌افزار رایانه‌ای
scope note: فرایندی در طراحی سامانۀ رایانه‌ای که نخست مؤلفه‌های اصلی را شناسایی و سپس آنها را مرحله‌به‌مرحله آن‌قدر تجزیه می‌کند تا میزان مناسبی از جزئیات مؤلفه‌ای حاصل شود.

طراحی
type: Concept
narrower: طراحی بالابه‌پایین
preferred label: design @en