تردش هیدروژنی محیطی
type: Concept
broader: تردش هیدروژنی
preferred label: hydrogen environment embrittlement @en
scope note: نوعی تُردش هیدروژنی که در هنگام تغییر شکل مومسان (plastic deformation) آلیاژها در تماس با گازهای هیدروژنی و یا واکنش‌های خوردگی به ‌وجود می‌آید و با آهنگ کرنش رابطۀ معکوس و با میزان و خلوص هیدروژن رابطۀ مستقیم دارد.

تردش هیدروژنی
type: Concept
narrower: تردش هیدروژنی محیطی
preferred label: hydrogen embrittlement @en