شماره‏گیری مستقیم از بیرون
type: Concept
broader: شماره‏گیری مستقیم
preferred label: direct inward dialing @en
scope note: امکان برقراری تماس از بیرون با شمارۀ "خدمات خاص مرکز تلفن"، بدون دخالت کاروَر

شماره‏گیری مستقیم
type: Concept
narrower: شماره‏گیری مستقیم از بیرون
preferred label: direct dialing-in @en