شماره‌گیری پیش‌گزیده
type: Concept
broader: شماره‏گیری
preferred label: predictive dialing @en
related: رایانه
scope note: تماس‌گیری خودکار رایانه با تعدادی از شماره‌های تماس ازپیش‌تعیین‌شده، بدون دخالت انسان و سپس اتصال به کارور در صورت پاسخگویی مخاطب تماس

شماره‏گیری
type: Concept
narrower: شماره‌گیری پیش‌گزیده
preferred label: dialing @en

رایانه
type: Concept
preferred label: computer @en
related: شماره‌گیری پیش‌گزیده