شماره‌گیری پیش‌نمایشی
type: Concept
broader: شماره‏گیری
preferred label: preview dialing @en
scope note: نوعی شماره‌گیری خودکار که در آن ابتدا شمارۀ مخاطب تماس بر روی نمایش‌گر نمایش داده می‌شود، سپس در صورت تأیید کاربر تماس برقرار می‌شود.

شماره‏گیری
type: Concept
narrower: شماره‌گیری پیش‌نمایشی
preferred label: dialing @en