پخش مبادله‌ای
type: Concept
broader: پخش
preferred label: exchange diffusion @en
related: غشا
scope note: فرایندی که در آن پخش مولکول‌ها از خلال غشا در دو جهت مخالف به تعادل می‌رسد.

پخش
type: Concept
narrower: پخش مبادله‌ای
preferred label: diffusion @en

غشا
type: Concept
preferred label: membrane @en
related: پخش مبادله‌ای