ریشه‌کنی بیماری
type: Concept
broader: بیماری
preferred label: disease eradication @en
scope note: قطع انتقال بیماری و پیدا نشدن مورد جدیدی از آن در مدت معین

بیماری
type: Concept
narrower: ریشه‌کنی بیماری
preferred label: disease @en