پاشش چرخش اپتیکی
type: Concept
alternative label: پاشش چرخش نوری
broader: پاشش (موج)
preferred label: optical rotatory dispersion @en
scope note: پاشش حاصل از تغییر چرخش نوری براثر عبور مادۀ فعال نوری، در هنگام تغییر طولِ‌موج

پاشش (موج)
type: Concept
narrower: پاشش چرخش اپتیکی
preferred label: dispersion (wave) @en