زهکشی بسته
type: Concept
alternative label: زهکشی کور
broader: زهکشی
preferred label: closed drainage @en
scope note: نوعی زهکشی سطحی که مانند زهکشی یک حوضۀ داخلی به سوی بخش مرکزی است و راهی به اقیانوس ندارد.

زهکشی
type: Concept
narrower: زهکشی بسته
preferred label: drainage @en