ابر یخساریده
type: Concept
broader: ابر
preferred label: glaciated cloud @en
scope note: اَبری که تمام یا بخشی از قطره‌های آب اَبَرسرد آن به یخ‌بلور تبدیل شده است.

ابر
type: Concept
narrower: ابر یخساریده
preferred label: cloud @en