توفان زمین‌لرزه
type: Concept
broader: زمین‌لرزه
preferred label: earthquake storm @en
scope note: توالی زمین‌لرزه‌های بزرگ در یک دورۀ زمانی چندساله تا چندده‌ساله در مسافت‌های چندصدکیلومتری

زمین‌لرزه
type: Concept
narrower: توفان زمین‌لرزه
preferred label: earthquake @en