خوشه‌زمین‌لرزه
type: Concept
broader: زمین‌لرزه
preferred label: earthquake swarm @en
scope note: مجموعه‌ای از زمین‌لرزه‌های کوچک در گسترۀ زمانی و مکانی محدود، بدون زمین‌لرزۀ اصلی قابل‌تشخیص

زمین‌لرزه
type: Concept
narrower: خوشه‌زمین‌لرزه
preferred label: earthquake @en