زمین‌لرزه چکانشی
type: Concept
broader: زمین‌لرزه
preferred label: triggered earthquake @en
scope note: زمین‌لرزه‌ای که در هنگام زمین‌لرزۀ اصلی یا زمان کوتاهی پس از آن کاملاً بیرون از منطقۀ پس‌لرزه‌ها روی می‌دهد.

زمین‌لرزه
type: Concept
narrower: زمین‌لرزه چکانشی
preferred label: earthquake @en