بوم‌شناسی اجتماع
type: Concept
broader: بوم‌شناسی
preferred label: community ecology @en
scope note: بررسی نحوۀ سازمان‌یافتگی و کارکرد اجتماع‌هایی که حاصل گردهم‌‌آمدن انسان‌ها در یک پهنه یا زیستگاه خاص است.

بوم‌شناسی
type: Concept
narrower: بوم‌شناسی اجتماع
preferred label: ecology @en