بوم‌شناسی منظر
type: Concept
broader: بوم‌شناسی
preferred label: landscape ecology @en
scope note: 1. مطالعۀ رشد و توسعۀ تنوع منظر با بهره‌گیری از مفاهیم حوزه‌های بوم‌شناسی و زیست‌شناسی حیات‌وحش و انسان‌شناسی فرهنگی و برنامه‌ریزی منظر و علوم اقتصادی 2. ارزیابی و تحلیل الگوهای زمانی و مکانی توسعۀ منظر

بوم‌شناسی
type: Concept
narrower: بوم‌شناسی منظر
preferred label: ecology @en