چفته هره‌چین
type: Concept
broader: چفته تخت
preferred label: soldier arch @en
scope note: چَفتۀ تختی که آجرهای آن قائم چیده شده باشد.

چفته تخت
type: Concept
narrower: چفته هره‌چین
preferred label: flat arch @en