چفته تاج‌مهره‌ای
type: Concept
broader: چفته
preferred label: keystone arch @en
scope note: چَفته‌ای، معمولاً تخت یا کم‌خیز، که در وسط تاج‌مهره دارد.

چفته
type: Concept
narrower: چفته تاج‌مهره‌ای
preferred label: arch (structural) @en