بازده حذف
type: Concept
broader: بازده
preferred label: removal efficiency @en
scope note: نسبت بدهِ (debit) جرمی آلایندۀ ورودی منهای بدهِ جِرمی آن در خروجی به بدهِ آلایندۀ ورودی

بازده
type: Concept
narrower: بازده حذف
preferred label: efficiency @en