پست باجه‌ای
type: Concept
broader: پست برق
preferred label: kiosk substation @en
scope note: پست برق کوچک و اغلب پیش‌ساخته‌ای که معمولاً فقط برای توزیع از آن استفاده می‌شود.

پست برق
type: Concept
narrower: پست باجه‌ای
preferred label: electric substation @en