چفته دومفصلی
type: Concept
broader: چفته
preferred label: two-hinged arch @en
scope note: چَفته‌ای که اتصال آن به پاکار در دو سرِ چَفته از نوع اتصال مفصلی (hinged joint) است.

چفته
type: Concept
narrower: چفته دومفصلی
preferred label: arch (structural) @en