پست افزایندۀ ولتاژ
type: Concept
broader: پست مبدل ولتاژ
preferred label: step-up substation @en
scope note: پست مبدل ولتاژی که ولتاژ خروجی آن بالاتر از ولتاژ ورودی آن است.

پست مبدل ولتاژ
type: Concept
narrower: پست افزایندۀ ولتاژ
preferred label: transformer substation @en