تخلیه الکتریکی
type: Concept
preferred label: electric discharge @en
related: جریان نشتی

جریان نشتی
type: Concept
broader: جریان معیوب الکتریکی
preferred label: leakage current @en
related: تخلیه الکتریکی
scope note: جریان مستقیم ضعیفی که ناخواسته از دی‌الکتریک موجود در خازن عبور می‌کند.

جریان معیوب الکتریکی
type: Concept
narrower: جریان نشتی
preferred label: electric fault current @en