کاف انرژی
type: Concept
broader: ساختار نواری
preferred label: energy gap @en
scope note: گستره‌ای از ترازهای انرژی غیرمجاز بین دو نوار مجاز انرژی

ساختار نواری
type: Concept
narrower: کاف انرژی
preferred label: band structure @en