ذرات سپیدایی
type: Concept
broader: ذره بنیادی
preferred label: albedo particles @en
scope note: نوترون‌ها یا ذرات بنیادی دیگر که پس از تولید ازطریق برهم‌کنش‌های هسته‌ای ذرات پرانرژی در درون جوّ زمین، آن را ترک می‌کنند.

ذره بنیادی
type: Concept
narrower: ذرات سپیدایی
preferred label: elementary particle @en