الکترون‌های درونی
type: Concept
broader: الکترون
preferred label: core electrons @en
scope note: الکترون‌هایی که تمام ترازهای انرژی یک اتم، غیر از تراز ظرفیت را پر می‌کنند.

الکترون
type: Concept
narrower: الکترون‌های درونی
preferred label: electron @en