یون‌تکه
type: Concept
broader: یون
preferred label: fragment ion @en
scope note: نوعی محصول یونی که از تکه‌تکه شدن یک پیش‌سازِ یونِ محصول به دست می‌آید و ممکن است پایدار باشد یا به تکه‌تکه شدن ادامه دهد.

یون
type: Concept
narrower: یون‌تکه
preferred label: ion @en