یون پیش‌ساز
type: Concept
broader: یون
preferred label: precursor ion @en
scope note: هر یونی که تکه‌تکه شود و بتوان آن را پیش‌ساز مستقیم یک یون‌تکۀ نهایی به‌ شمار آورد.

یون
type: Concept
narrower: یون پیش‌ساز
preferred label: ion @en