یون رادیکال
type: Concept
broader: یون
preferred label: radical ion @en
scope note: مولکولی که الکترون زوج‌نشده دارد و درعین‌حال دارای بار منفی کامل است.

یون
type: Concept
narrower: یون رادیکال
preferred label: ion @en