زغال‌سنگ جلبکی
type: Concept
broader: زغال‌سنگ
preferred label: bog head coal @en
scope note: زغال‌سنگی که به‌طور عمده از مواد جلبکی تشکیل شده است.

زغال‌سنگ
type: Concept
narrower: زغال‌سنگ جلبکی
preferred label: coal @en