مهندسی صوت
type: Concept
alternative label: مهندسی آکوستیک
broader: مهندسی
preferred label: acoustical engineering @en
related: صوت‌شناسی
scope note: کاربرد عملی علم آکوستیک/ صوت‌شناسی که شامل واپایش نوفه و ارتعاشات و تولید و پخش صدا و استفاده از وسایل اندازه‌گیری صداست.

مهندسی
type: Concept
narrower: مهندسی صوت
preferred label: engineering @en

صوت‌شناسی
type: Concept
preferred label: acoustics @en
related: مهندسی صوت