مهندسی پادتن
type: Concept
broader: مهندسی
preferred label: antibody engineering @en
related: پادتن تک‌دودمان
scope note: دستکاری پادتن‌های تک‌دودمانی بیگانۀ تولیدشده در یاخته‌های جانوری با هدف استفادۀ درمانی در انسان

مهندسی
type: Concept
narrower: مهندسی پادتن
preferred label: engineering @en

پادتن تک‌دودمان
type: Concept
preferred label: monoclonal antibody @en
related: مهندسی پادتن