زیست‌مهندسی
type: Concept
broader: مهندسی
preferred label: bioengineering @en
related: مهندسی زیست‌مواد
scope note: کاربرد روش‌های مهندسی برای دستیابی به بیوسنتز (biosynthesis) فراورده‌های جانوری و گیاهی مانند فرایند تخمیر

مهندسی زیست‌مواد
type: Concept
preferred label: biomaterial engineering @en
related: زیست‌مهندسی

مهندسی
type: Concept
narrower: زیست‌مهندسی
preferred label: engineering @en