مهندسی مواد غذایی
type: Concept
alternative label: مهندس مواد غذایی
broader: مهندسی
preferred label: food engineering @en
scope note: یکی از شاخه‌های علوم و فنّاوری غذا که به ساخت و فراوری محصولات غذایی و بررسی خصوصیات فنی آنها می‌پردازد.

مهندسی
type: Concept
narrower: مهندسی مواد غذایی
preferred label: engineering @en