مهندسی فراوری غذا
type: Concept
broader: مهندسی
preferred label: food process engineering @en
scope note: استفاده از خصوصیات مواد غذایی برای طراحی و ساخت تجهیزات و فراوری محصولات غذایی

مهندسی
type: Concept
narrower: مهندسی فراوری غذا
preferred label: engineering @en