مهندسی یاخته‌ای
type: Concept
broader: مهندسی پزشکی
preferred label: cellular engineering @en
related: یاخته
scope note: دستکاری یاخته‌ها برای ایجاد تغییر در حالت طبیعی آنها و استفاده از اصول مهندسی برای تشکیل مدارهای یاخته‌ای با ویژگی‌های خاص

مهندسی پزشکی
type: Concept
narrower: مهندسی یاخته‌ای
preferred label: medical engineering @en

یاخته
type: Concept
preferred label: cell @en
related: مهندسی یاخته‌ای