مهندسی انسان‌نگر
type: Concept
broader: مهندسی پزشکی
preferred label: human factors engineering @en
scope note: رشته‌ای که در آن طراحی وسایل و سامانه‌ها و محیط‌های کار با در نظر گرفتن قابلیت‌ها و محدودیت‌های انسان صورت می‌گیرد.

مهندسی پزشکی
type: Concept
narrower: مهندسی انسان‌نگر
preferred label: medical engineering @en