مهندسی پروتئین
type: Concept
broader: مهندسی
preferred label: protein engineering @en
scope note: بهبود کیفیت خواص فیزیکی و شیمیایی یک پروتئین طبیعی برای استفاده از آن در فرایندهای زیست‌فنّاورانه

مهندسی
type: Concept
narrower: مهندسی پروتئین
preferred label: engineering @en