ریزبین فراصوتی
type: Concept
alternative label: میکروسکوپ فراصوتی
broader: تجهیزات فراصوتی
preferred label: ultrasonic microscope @en
scope note: نوعی ریزبین/ میکروسکوپ که با استفاده از امواج فراصوتی کار می‌کند.

تجهیزات فراصوتی
type: Concept
narrower: ریزبین فراصوتی
preferred label: ultrasonic equipment @en