تایر کشاورزی
type: Concept
broader: ادوات کشاورزی
preferred label: agricultural tyre @en
scope note: تایر مخصوص خودروهای کشاورزی، مانند تراکتور و برخی از کمباین‌ها

ادوات کشاورزی
type: Concept
narrower: تایر کشاورزی
preferred label: agricultural implements @en