ترمز خودکار
type: Concept
broader: ترمز
preferred label: automatic brake @en
scope note: ترمزی که چنانچه لولۀ آن قطع شود، به‌صورت خودکار عمل می‌کند.

ترمز
type: Concept
narrower: ترمز خودکار
preferred label: brake @en