دستگیره تبدیل ترمز
type: Concept
broader: ترمز
preferred label: brake change-over device @en
scope note: دستگیره‌ای برای تغییر وضعیت سامانۀ ترمز قطار در دو طرف واگن

ترمز
type: Concept
narrower: دستگیره تبدیل ترمز
preferred label: brake @en