دیسک ترمز
type: Concept
broader: ترمز
preferred label: brake disc @en
scope note: بخشی از ترمز دیسکی که متشکل از یک صفحۀ فولادی یا چدنی یا آلومینیمی است که بر روی محور چرخ سوار می‌شود.

ترمز
type: Concept
narrower: دیسک ترمز
preferred label: brake @en