ترمز اضطراری لوکوموتیو
type: Concept
broader: ترمز لوکوموتیو
preferred label: emergency locomotive brake @en
scope note: ترمزی که لوکوموتیوران در مواقع اضطراری می‌کشد تا سرعت لوکوموتیو را کاهش دهد یا آن را متوقف کند.

ترمز لوکوموتیو
type: Concept
narrower: ترمز اضطراری لوکوموتیو
preferred label: locomotive brake @en