کوره قوسی
type: Concept
alternative label: کوره قوس الکتریکی
broader: کوره
preferred label: arc furnace @en
scope note: کوره‌ای که برای ذوب فلزات و آلیاژها مورد استفاده قرار می‌گیرد و در آن، ذوب یا به‌طور مستقیم ازطریق ایجاد قوس الکتریکی بین دو الکترود و بار درون کوره انجام می‌شود یا به‌طور غیرمستقیم ازطریق برقراری قوس الکتریکی بین دو الکترود در نزدیکی بار

کوره
type: Concept
narrower: کوره قوسی
preferred label: furnace @en