کوره اتاقکی
type: Concept
broader: کوره
preferred label: box furnace @en
scope note: کوره‌ای جعبه‌ای‌شکل که بدنه‌ها در آن پخته می‌شوند.

کوره
type: Concept
narrower: کوره اتاقکی
preferred label: furnace @en