کوره پیش‌بر
type: Concept
broader: کوره مداوم
preferred label: pusher furnace @en

کوره مداوم
type: Concept
broader: کوره
narrower: کوره پیش‌بر
preferred label: continuous furnace @en
scope note: کوره‌ای که پیوسته در آن مواد از یک دهانه وارد و پس از انجام عملیات موردنظر، به‌تدریج از دهانۀ دیگر خارج می‌شوند.

کوره
type: Concept
narrower: کوره مداوم
preferred label: furnace @en