سوپاپ اطمینان ترمز
type: Concept
broader: سوپاپ
preferred label: brake check valve @en
related: واگن راه‌آهن
scope note: وسیله‌ای در سامانۀ ترمز قطار برای جلوگیری از برگشت جریان هوای فشرده

سوپاپ
type: Concept
narrower: سوپاپ اطمینان ترمز
preferred label: valve (mechanical) @en

واگن راه‌آهن
type: Concept
preferred label: railroad car @en
related: سوپاپ اطمینان ترمز