شیر رله اضطراری
type: Concept
broader: سوپاپ
preferred label: emergency relay valve @en
related: واگن راه‌آهن
scope note: شیری که در وضعیت اضطراری شیرترمز خودکار، توسط مخزن هوای اصلی به کار می‌افتد.

سوپاپ
type: Concept
narrower: شیر رله اضطراری
preferred label: valve (mechanical) @en

واگن راه‌آهن
type: Concept
preferred label: railroad car @en
related: شیر رله اضطراری