مجرای کنارگذر
type: Concept
broader: مجرا
preferred label: bypass duct @en
scope note: مجرایی در اطراف موتور توربین پروانه‌ای که برای خروج هوای فشردۀ آن و تولید نیروی رانشی به کار می‌رود.

مجرا
type: Concept
narrower: مجرای کنارگذر
preferred label: duct @en